{"text_format":"2","workbook":"xlsx","n_sheets":19,"sheets":["Nutzungshinweise","INPUT | Allgemeines","INPUT | TSz > Technik","INPUT | TSz > iHaSt","INPUT | TSz > Kosten","INPUT | TSz > Erlöse & Finanz","INPUT | KSz > Technik","INPUT | KSz > Kosten","INPUT | KSz > Erlöse & Finanz","Nebenrechnungen","Intern","Ergebnis ","Begründungen","INTERN | Prüfung","Deckblatt","Tatsächliches Szenario","Kontrafaktisches Szenario","Zusammenfassung","Ablage"],"not_rendered":{"charts":5,"images":5,"macros":0,"external_links":2,"defined_names":33,"comments":2,"pivot_tables":0},"unopened":[],"bounds":{"document_bytes":16777216,"sheet_cells":100000,"run_cost":"one","rows_first":2000,"rows_last":500,"rows_between":2000,"halvings":0,"cell_chars":16384,"cell_head_chars":4096},"cells_cut":0,"cells_raw":0,"read":"whole","date_system":"1900"}

{"sheet":"Nutzungshinweise","index":0,"n_rows":53,"n_cols":2,"rows_kept":53,"cut":false,"hidden":false,"merged":[]}
[]
[null,"Tool zur Berechnung der Finanzierungslücke bei Investitionen \nin hocheffiziente KWK-Anlagen & Wärme-/Kältenetze"]
[null,"Bezug: Allgemeine Gleichstellungsverordnung (AGVO) in der Fassung vom 30.06.2023"]
[null,"Version 250509 FW"]
[]
[]
[]
[null,"Nutzungshinweis:\nErrechnete Werte sind ausschließlich indikativ und stellen keinen Förderanspruch dar. \nDie Eingaben erfolgen in den blau hinterlegten Eingabefeldern. Die Veränderung von Zellen und Formeln in dieser Exceldatei ist unzulässig. \n"]
[null,"Nutzen Sie bitte immer die aktuelle Version des Berechnungstools. Sie finden es auf der Internetseite der Sächsischen Aufbaubank - Förderbank bei der konkreten Förderung und auf der Homepage der Sächsischen Agentur für Strukturentwicklung GmbH."]
[]
{"$rows_left_out":44}
{"sheet":"INPUT | Allgemeines","index":1,"n_rows":102,"n_cols":24,"rows_kept":102,"cut":false,"hidden":false,"merged":[[6,12,8,12],[16,6,16,9],[8,6,8,9],[6,6,6,9],[27,12,29,12],[33,12,34,12],[33,6,33,9],[12,6,12,9],[18,6,18,9],[12,12,14,12],[18,12,19,12],[20,12,21,12],[22,12,23,12]]}
[]
[null,"Allgemeine Daten",{"$nulls":10},"Hinweise/ Anmerkungen",null,"Ausblenden","Ausblenden","Ausblenden","Ausblenden","Ausblenden","Ausblenden","Ausblenden","Ausblenden","Ausblenden","Ausblenden"]
[{"$nulls":12},"blau hinterlegte Felder sind Eingabefelder"]
[]
[null,"Eingabe 1: Angaben zum Antragsteller und zum Projekt"]
[]
[null,"Bezeichnung des antragstellenden Unternehmens:",{"$nulls":10},"Diese Daten werden zur Bezeichnung der Berechnungsblätter und für Berechnungen in diesem Tool verwendet."]
[]
[null,"Projektkurztitel:"]
[]
{"$rows_left_out":93}
{"sheet":"INPUT | TSz > Technik","index":2,"n_rows":150,"n_cols":26,"rows_kept":150,"cut":false,"hidden":false,"merged":[[54,12,59,12],[46,12,48,12],[8,12,10,12],[39,12,40,12],[15,12,17,12],[12,12,14,12]]}
[{"$nulls":18},"Ausblenden"]
[null,"Technische Parameter der geplanten Anlagenkonstellation & Wärmeabsatz",{"$nulls":10},"Hinweise/ Anmerkungen",{"$nulls":5},"Ausblenden","Ausblenden","Ausblenden","Ausblenden","Ausblenden","Ausblenden","Ausblenden","Ausblenden"]
[null,{"$f":"CONCATENATE(\"Tatsächliches Szenario (TSz) | \",Kurztitel)","v":"Tatsächliches Szenario (TSz) | "},{"$nulls":10},"blau hinterlegte Felder sind Eingabefelder"]
[]
[]
[null,"Eingabe 1: Wärmeerzeugung"]
[]
[{"$nulls":6},"optional","optional"]
[{"$nulls":5},"Erzeugungsanlage 1","Erzeugungsanlage 2","Erzeugungsanlage 3",{"$nulls":4},"Wählen Sie die Erzeugungsanlage/-n aus den Optionsfeld und ergänzen Sie die Angaben zu den Nutzungsgraden."]
[]
{"$rows_left_out":141}
{"sheet":"INPUT | TSz > iHaSt","index":3,"n_rows":113,"n_cols":26,"rows_kept":113,"cut":false,"hidden":false,"merged":[[56,13,58,13],[5,10,5,11],[54,13,55,13],[1,1,1,11],[9,13,11,13],[15,13,17,13],[28,13,29,13],[33,13,35,13],[21,13,24,13],[4,13,5,13]]}
[{"$nulls":18},"Ausblenden","Ausblenden","Ausblenden","Ausblenden","Ausblenden","Ausblenden"]
[null,"Anwendungsfall iHast im Bestand | Zusätzliche Angaben im Tatsächlichen Szenario",{"$nulls":11},"Hinweise/ Anmerkungen"]
[{"$nulls":13},"blau hinterlegte Felder bitte auswählen oder ausfüllen."]
[null,"Diese Tabelle ist nur bei Einbau von intelligenten Hausanschlussstationen (iHaSt) in bestehende Wärme-/Kältenetze anzuwenden!"]
[{"$nulls":13},"Die Berechnung des Tatsächlichen Szenarios wird um die hier vorgenommenen Eingaben ergänzt!"]
[null,"Ersetzen Sie im Bestandsnetz bestehende Hausanschlußstationen mit iHaSt?",{"$nulls":5},"Nein.",null,null,{"$f":"INDEX(X77:X78,MATCH(H6,S77:S78,0))","v":"Tabelle ist NICHT aktiv"}]
[]
[null,"Eingabe 1: Systemparameter des Bestandsnetzes "]
[]
[null,"Mittlerer Wärmeverlust des Wärmenetzes (Übertragungsverlust)",{"$nulls":11},"Der Wert dient als Bezugsgröße für die durch den iHast-Einsatz induzierte Reduzierung des Übertragungsverlustes."]
{"$rows_left_out":104}
{"sheet":"INPUT | TSz > Kosten","index":4,"n_rows":108,"n_cols":23,"rows_kept":108,"cut":false,"hidden":false,"merged":[[11,1,11,2],[48,13,55,13],[9,13,13,13],[14,13,16,13],[17,13,19,13],[20,13,21,13]]}
[]
[null,"Kosten",{"$nulls":9},"Alle Kosten-/Preisangaben in Euro netto.",null,"Hinweise/ Anmerkungen",null,"Ausblenden","Ausblenden","Ausblenden","Ausblenden","Ausblenden","Ausblenden","Ausblenden","Ausblenden"]
[null,{"$f":"CONCATENATE(\"Tatsächliches Szenario (TSz) | \",Kurztitel)","v":"Tatsächliches Szenario (TSz) | "},{"$nulls":11},"blau hinterlegte Felder sind Eingabefelder"]
[]
[{"$nulls":7},"Brennstoff",null,"Brennstoffkosten","Kostenentw. Brennstoff"]
[null,"Eingabe 1: Kosten für die Anschaffung der Anlagen und Herstellung der Funktion | Investitionskosten"]
[]
[{"$nulls":4},"Technische","Gebäude &","Grunderwerb &","immaterielle","Personalkosten","Sachverständigen-, ","Sonstige Kosten"]
[{"$nulls":4},"Anlagen","bauliche Anlagen","-nebenkosten","Vermögenswerte",null,"Planungs-, Beratg.-"]
[{"$nulls":9},"leistungen",null,null,null,"Achtung: Zur Ermittlung der Finanzierungslücke sind alle Investitionen anzugeben. Investitionen außerhalb der Förderperiode sind nicht förderfähig  (unterhalb der roten Linie), werden aber zur Berechnung der Finanzierungslücke herangezogen."]
{"$rows_left_out":99}
{"sheet":"INPUT | TSz > Erlöse & Finanz","index":5,"n_rows":101,"n_cols":25,"rows_kept":101,"cut":false,"hidden":false,"merged":[[56,8,56,14],[42,17,44,17],[39,17,41,17],[16,17,17,17],[54,17,58,17],[6,12,12,14],[7,8,8,8],[7,10,8,10],[6,17,8,17],[41,8,41,12],[9,17,12,17],[21,17,24,17]]}
[]
[null,"Erlöse, Finanzierung & Restwert",{"$nulls":13},"Alle Kosten-/Preisangaben netto.",null,"Hinweise/ Anmerkungen",null,"Ausblenden","Ausblenden","Ausblenden","Ausblenden","Ausblenden","Ausblenden"]
[null,{"$f":"CONCATENATE(\"Tatsächliches Szenario (TSz) | \",Kurztitel)","v":"Tatsächliches Szenario (TSz) | "},{"$nulls":15},"blau hinterlegte Felder sind Eingabefelder"]
[]
[null,"Eingabe 1: Einnahmen …"]
[]
[null,"… aus Systemnutzung | Eingabeoption 1 | Hochrechnung",{"$nulls":10},"... aus Netzanschluss & sonstige Einnahmen",{"$nulls":4},"Einnahmen aus Netzanschluss: Dem Anschlußnehmer für die Herstellung oder Umstellung des Anschlusses berechnete Kosten. Summe über alle geplanten Anschlüsse."]
[{"$nulls":8},"Mischpreis \n[Euro/MWh]",null,"Preisentwicklung \n[%/Jahr]"]
[]
[null,null,"im Jahr der Inbetriebnahme >>>",null,null,null,"Wärme",{"$nulls":10},"Der Mischpreis  setzt sich  aus Arbeitspreis, Grund- oder Leistungspreis und Mess- oder Verrechnungspreis zusammen. Dieser ist durch den Antragsteller über die potenziell zu erwartende/n Kunden(struktur) zu kalkulieren. "]
{"$rows_left_out":83}
{"sheet":"INPUT | KSz > Technik","index":6,"n_rows":124,"n_cols":26,"rows_kept":124,"cut":false,"hidden":false,"merged":[[56,12,58,12],[8,12,10,12],[12,12,14,12],[15,12,17,12],[39,12,40,12],[45,12,47,12]]}
[{"$nulls":18},"Ausblenden"]
[null,"Technische Parameter der geplanten Anlagenkonstellation & Wärmeabsatz",{"$nulls":10},"Hinweise/ Anmerkungen",{"$nulls":5},"Ausblenden","Ausblenden","Ausblenden","Ausblenden","Ausblenden","Ausblenden","Ausblenden","Ausblenden"]
[null,{"$f":"CONCATENATE(\"Kontrafaktisches Szenario (TSz) | \",Kurztitel)","v":"Kontrafaktisches Szenario (TSz) | "},{"$nulls":10},"blau hinterlegte Felder sind Eingabefelder"]
[]
[]
[null,"Eingabe 1: Wärmeerzeugungsanlagen",{"$nulls":8},"Keine Eingabe erforderlich."]
[]
[{"$nulls":6},"optional","optional"]
[{"$nulls":5},"Erzeugungsanlage 1","Erzeugungsanlage 2","Erzeugungsanlage 3",{"$nulls":4},"Wählen Sie die Erzeugungsanlage/-n aus den Optionsfeld und ergänzen Sie die Angaben zu den Nutzungsgraden."]
[]
{"$rows_left_out":115}
{"sheet":"INPUT | KSz > Kosten","index":7,"n_rows":112,"n_cols":23,"rows_kept":112,"cut":false,"hidden":false,"merged":[[48,13,55,13],[9,13,11,13],[11,1,11,2],[13,13,15,13],[16,13,18,13],[19,13,20,13]]}
[]
[null,"Kosten",{"$nulls":9},"Alle Kosten-/Preisangaben in Euro netto.",null,"Hinweise/ Anmerkungen",null,"Ausblenden","Ausblenden","Ausblenden","Ausblenden","Ausblenden","Ausblenden","Ausblenden","Ausblenden"]
[null,{"$f":"CONCATENATE(\"Kontrafaktisches Szenario (TSz) | \",Kurztitel)","v":"Kontrafaktisches Szenario (TSz) | "},{"$nulls":11},"blau hinterlegte Felder sind Eingabefelder"]
[]
[{"$nulls":7},"Brennstoff",null,"Brennstoffkosten","Kostenentw. Brennstoff"]
[null,"Eingabe 1: Kosten für die Anschaffung der Anlagen und Herstellung der Funktion | Investitionskosten"]
[]
[{"$nulls":4},"Technische","Gebäude &","Grunderwerb &","immaterielle","Personalkosten","Sachverständigen-, ","Sonstige Kosten"]
[{"$nulls":4},"Anlagen","bauliche Anlagen","-nebenkosten","Vermögenswerte",null,"Planungs-, Beratg.-"]
[{"$nulls":9},"leistungen",null,null,null,"Achtung: Zur Ermittlung der Finanzierungslücke sind alle Investitionen anzugeben. "]
{"$rows_left_out":103}
{"sheet":"INPUT | KSz > Erlöse & Finanz","index":8,"n_rows":99,"n_cols":25,"rows_kept":99,"cut":false,"hidden":false,"merged":[[6,12,12,14],[6,17,8,17],[7,8,8,8],[7,10,8,10],[9,17,12,17],[39,17,41,17],[41,8,41,12],[42,17,44,17],[54,17,58,17],[16,17,17,17]]}
[]
[null,"Erlöse, Finanzierung & Restwert",{"$nulls":13},"Alle Kosten-/Preisangaben netto.",null,"Hinweise/ Anmerkungen",null,"Ausblenden","Ausblenden","Ausblenden","Ausblenden","Ausblenden","Ausblenden"]
[null,{"$f":"CONCATENATE(\"Tatsächliches Szenario (TSz) | \",Kurztitel)","v":"Tatsächliches Szenario (TSz) | "},{"$nulls":15},"blau hinterlegte Felder sind Eingabefelder"]
[]
[null,"Eingabe 1: Einnahmen …",{"$nulls":13},"Keine Eingabe erforderlich."]
[]
[null,"… aus Systemnutzung | Eingabeoption 1 | Hochrechnung",{"$nulls":10},"... aus Netzanschluss & sonstige Einnahmen",{"$nulls":4},"Einnahmen aus Netzanschluss: Dem Anschlußnehmer für die Herstellung oder Umstellung des Anschlusses berechnete Kosten. Summe über alle geplanten Anschlüsse."]
[{"$nulls":8},"[ Euro/MWh]",null,"Preisentwicklung \n[%/Jahr]"]
[]
[null,"Mischpreis ","im Startjahr >>>",null,null,null,"Wärme",{"$nulls":10},"Der Mischpreis  setzt sich  aus Arbeitspreis, Grund- oder Leistungspreis und Mess- oder Verrechnungspreis zusammen. Dieser ist durch den Antragsteller über die potenziell zu erwartende/n Kunden(struktur) zu kalkulieren. "]
{"$rows_left_out":75}
{"sheet":"Nebenrechnungen","index":9,"n_rows":62,"n_cols":123,"rows_kept":62,"cut":false,"hidden":false,"merged":[[14,75,14,76],[11,71,11,72],[11,73,11,74],[12,71,12,72],[12,73,12,74],[14,71,14,72],[14,73,14,74],[12,75,12,76],[11,75,11,76],[12,88,12,89],[11,84,11,85],[11,86,11,87],[12,84,12,85],[12,86,12,87],[11,88,11,89],[6,5,6,6],[6,29,6,32],[6,43,6,46],[12,12,12,13],[12,14,12,15],[12,16,12,17],[12,25,12,26],[12,27,12,28],[6,33,6,34],[5,31,5,32],[11,12,11,13],[11,14,11,15],[11,16,11,17],[11,25,11,26],[11,27,11,28],[11,29,11,30],[6,7,6,14],[5,27,5,28],[5,29,5,30],[14,12,14,13],[14,14,14,15],[14,16,14,17],[12,29,12,30],[5,7,5,12],[5,13,5,14],[5,15,5,16],[5,17,5,18],[5,25,5,26],[6,96,6,97],[6,98,6,99],[6,36,6,37],[6,94,6,95],[6,25,6,26],[6,27,6,28]]}
[]
[null,{"$f":"CONCATENATE(\"Nebenrechnungen Finanzierungslücke | \",Kurztitel,\" | \",'INPUT | Allgemeines'!G7)","v":"Nebenrechnungen Finanzierungslücke |  | "},{"$nulls":115},"Ausblenden","Ausblenden","Ausblenden","Ausblenden","Ausblenden","Ausblenden"]
[null,"Berechnung der Finanzierungslücke nach AGVO",{"$nulls":62},{"$f":"IF(DN59=0,DP59,\"\")","v":"Es wurde noch keine alternative Lösung ausgewählt."}]
[]
[]
[{"$nulls":52},{"$f":"'INPUT | TSz > iHaSt'!$X$82","v":"Tabelle ist NICHT aktiv"},null,null,{"$f":"'INPUT | TSz > iHaSt'!$X$82","v":"Tabelle ist NICHT aktiv"},{"$nulls":4},{"$f":"'INPUT | TSz > iHaSt'!$X$82","v":"Tabelle ist NICHT aktiv"}]
[{"$nulls":5},"Tatsächliches Szenario",{"$nulls":9},"Tatsächliches Szenario",{"$nulls":13},"Tatsächliches Szenario",{"$nulls":13},"Tatsächliches Szenario",{"$nulls":8},"Tatsächliches Szenario iHast",{"$nulls":11},"Kontrafaktisches  Szenario",{"$nulls":8},"Kontrafaktisches  Szenario",{"$nulls":10},"Kontrafaktisches  Szenario",{"$nulls":9},"Kontrafaktisches  Szenario",{"$nulls":8},"Kontrafaktisches  Szenario"]
[]
[{"$nulls":5},"Investitionen",null,null,"Wärmemenge",null,null,null,"Erforderliche Brennstoffwärme",{"$nulls":6},"Brennstoffenergie",null,null,null,"Wärmebezug",null,"Brennstoffkosten | Wärmebezugskosten bei \"Nur Netz\"",{"$nulls":7},"Instandhaltungskosten",null,null,"Betriebskosten ",null,"Erlöse aus Wärmeverkauf",null,null,null,"Erlöse aus Stromverkauf (bei KWK)",{"$nulls":5},"Sonstige Einnahmen",null,null,null,"iHAST Ausbau",null,"Veränderung der Wärmeabgabe",null,null,"Fernwärme Mischpreis",null,null,"Instandhaltungskosten",null,"All. Betriebskosten",null,"Investitionen",null,null,"Wärmemenge",null,null,null,"Erforderliche Brennstoffwärme",{"$nulls":6},"Brennstoffenergie",null,null,null,"Wärmebezug",null,"Brennstoffkosten | Wärmebezugskosten bei \"Nur Netz\"",{"$nulls":7},"Instandhaltungskosten Netz",null,null,"Betriebskosten Netz",null,"Erlöse aus Wärmeverkauf",null,null,null,"Erlöse aus Stromverkauf (bei KWK)",{"$nulls":5},"Sonstige"]
[{"$nulls":5},"im Jahr","kumuliert",{"$nulls":5},"Bezug: Heizwert Hi",{"$nulls":6},"Bezug: Brennwert Hs",{"$nulls":5},"wenn Erzeugungsanlage ausgewählt",null,null,"Bezug: Brennwert Hs",{"$nulls":7},"Allgemeine BK",{"$nulls":20},"zur Berechnung vermiedener Kosten",null,null,"Veränderung",null,"Veränderung",null,"im Jahr","kumuliert",{"$nulls":5},"Bezug: Heizwert Hi",{"$nulls":6},"Bezug: Brennwert Hs",{"$nulls":5},"wenn Erzeugungsanlage ausgewählt",null,null,"Bezug: Brennwert Hs",{"$nulls":7},"Allgemeine BK",{"$nulls":11},"Einnahmen"]
{"$rows_left_out":45}
{"sheet":"Intern","index":10,"n_rows":6,"n_cols":8,"rows_kept":6,"cut":false,"hidden":true,"merged":[[5,7,5,9]]}
[]
[]
["Beiblatt zur Prüfung der Zulässigkeit der angetrebten Förderung"]
[]
[]
[null,"Höchstzulässiger Fördersatz laut Förderrichtlinie (in Prozent):",{"$nulls":5},0.8]

{"sheet":"Ergebnis ","index":11,"n_rows":78,"n_cols":22,"rows_kept":78,"cut":false,"hidden":false,"merged":[[6,19,6,21],[8,19,8,21],[8,12,8,13],[8,15,8,17],[9,12,9,13],[9,15,9,17],[6,15,6,17],[6,12,6,13],[7,12,7,13],[7,15,7,17]]}
[]
[null,{"$f":"CONCATENATE(Kurztitel,\" | \",'INPUT | Allgemeines'!G7)","v":" | "}]
[null,"Berechnung der Finanzierungslücke nach AGVO",{"$nulls":19},{"$f":"Nutzungshinweise!B4","v":"Version 250509 FW"}]
[]
[]
[]
[null,"Zusammenfassung",{"$nulls":10},"Tatsächliches Szenario",null,null,"Kontrafakt. Szenario",null,null,null,"Finanzierungslücke"]
[null,"Alle Angaben in Euro",{"$nulls":8},"Gesamtinvestition",null,{"$f":"Nebenrechnungen!F21","v":0},null,null,{"$f":"Nebenrechnungen!BM21","v":0}]
[{"$nulls":10},"Kapitalwert",null,{"$f":"V20","v":0},null,null,{"$f":"V51","v":0},null,null,null,{"$f":"-IF(M9>0,0,M9-IF(P9>0,0,P9))","v":0}]
[{"$nulls":10},"Verwendeter WACC-Wert",null,{"$f":"WACCTSz","v":0.08},null,null,{"$f":"WACCKSz","v":0}]
{"$rows_left_out":69}
{"sheet":"Begründungen","index":12,"n_rows":61,"n_cols":10,"rows_kept":61,"cut":false,"hidden":false,"merged":[[15,0,15,9],[17,1,17,9],[26,0,26,9],[28,1,28,9],[31,0,31,9],[56,0,56,9],[58,1,58,9],[7,1,7,9],[5,0,5,9],[0,0,0,9],[1,0,1,9],[3,0,3,2],[4,3,4,9],[3,3,3,9],[43,0,43,9],[45,1,45,9],[48,0,48,9],[50,1,50,9],[10,0,10,9],[12,1,12,9],[33,1,33,9]]}
["Anlage 1: Begründungen"]
["Bitte dem Antrag als PDF beifügen."]
[]
["Projekt: ",null,null,{"$f":"Kurztitel","v":0}]
["Antragsteller",null,null,{"$f":"'INPUT | Allgemeines'!G7","v":0}]
["1. Veränderung des Betrachtungszeitraumes | Input Allgemeines > Eingabe 2 "]
[]
[]
[{"$nulls":9},"zurück"]
[]
{"$rows_left_out":39}
{"sheet":"INTERN | Prüfung","index":13,"n_rows":70,"n_cols":41,"rows_kept":70,"cut":false,"hidden":false,"merged":[[8,31,41,31],[14,3,16,3],[45,24,51,27],[10,20,10,21],[10,5,10,6],[10,8,10,9],[10,11,10,12],[10,14,10,15],[10,17,10,18],[10,23,10,24],[10,26,10,27],[50,8,50,23]]}
["NUTZUNG AUSSCHLIEßLICH DURCH DIE FÖRDERMITTELBEWILLIGENDE STELLE!       KEINE EINGABEN DES ANTRAGSTELLENDEN ERFORDERLICH."]
[]
[{"$f":"CONCATENATE(\"Bewertung der Förderfähigkeit der angegebenen Kosten | \",Kurztitel,\" | \",'INPUT | Allgemeines'!G7)","v":"Bewertung der Förderfähigkeit der angegebenen Kosten |  | "},{"$nulls":26},{"$f":"Nutzungshinweise!B4","v":"Version 250509 FW"},{"$nulls":7},"Ausblenden","Ausblenden","Ausblenden","Ausblenden","Ausblenden","Ausblenden"]
[]
[]
[]
[{"$f":"'Ergebnis '!B14","v":""},{"$nulls":4},"Legende >>>",null,"Angaben des Antragstellers",null,null,null,"Eingabefeld, kann überschrieben werden, Formelverlust!",{"$nulls":6},"Eingabefeld",null,null,"Ergebnis nach Prüfung",{"$nulls":9},"Hinweise zum Gebrauch:"]
[]
[{"$nulls":5},"Investitionen",{"$nulls":25},"Vorcheck: Wenn in allen Eingabefeldern zum Anteil der Förderfähigkeit in Zeile 13  100% eingetragen ist, sind die Einträge in der grauen und der daneben liegenden sandfarbenen Spalte eines Kostentyps identisch. Andernfalls wurden Veränderungen an der Tabelle vorgenommen.  \n\nSpalte D: Es kann jahresweise ausgewählt werden, welche Investitionsbeträge in der Berechnung berücksichtigt werden sollen. Ja >> Angaben des Jahres werden berücksichtigt. Nein >> … werden nicht berücksichtigt.\n\nZeile 13: Angaben zur Förderfähigkeit: Hier kann für Jeden der 7 Kostentypen angegeben werden, mit welchem Anteil (0% - 100%) diese in die Berechnung einfließen. Als Standard ist der Wert 100% hinterlegt. Der Anteil bezieht sich auf den vom Antragstellenden hinterlegten Investitionsbetrag im Kostentyp. Er gilt für alle Jahre gleich.\n\nSandfarben hinterlegte Felder können durch die fördermittelprüfende Stelle händisch verändert werden. Die Felder enthalten Formeln. Diese gehen bei der Eingabe verloren. Die Formeln können durch Hoch- oder Runterziehen bislang unveränderter Zellen aus der gleichen Spalte wiederhergestellt werden. Es wird dem Anwendenden empfohlen, händisch veränderte Zellen farblich anders zu markieren.\n\nZelle S48 Förderfähiger Investitionsbetrag: Errechnet sich aus den Angaben der sandfarben hinterlegten Zellen. \n\nZelle V48 Förderbetrag: Minimum aus Finanzierungslücke (Angaben des Antragstellenden) und Zelle S48"]
[]
{"$rows_left_out":61}
{"sheet":"Deckblatt","index":14,"n_rows":27,"n_cols":21,"rows_kept":27,"cut":false,"hidden":true,"merged":[[26,1,26,14],[23,1,23,14],[10,10,10,14],[11,10,11,14],[12,10,12,14],[13,10,13,14],[20,1,20,14],[21,1,21,14],[25,1,25,14],[19,1,19,14],[14,10,14,14],[15,10,15,14],[6,0,6,5],[7,0,7,5],[10,8,15,8],[22,1,22,14],[24,1,24,14],[3,9,3,14],[4,9,4,14],[5,9,5,14],[3,1,3,6],[4,1,4,6],[5,1,5,6],[3,8,5,8]]}
["Berechnung der Finanzierungslücke für den Bau und die Modernisierung von leitungsgebundenen Infrastrukturen ",{"$nulls":14},"Nebenrechnung (wird evtl. für den Antragsteller ausgeblendet)"]
["Version: 1/2023 SMEKUL"]
[{"$nulls":16},"Tatsächl. SZ","Kontraf. SZ","Kontraf. SZ Altanlagen"]
["Antragsteller:",{"$nulls":7},"LEGENDE","Zellen enthalten integrierte Formeln und Verknüpfungen - nicht ändern",{"$nulls":5},"WACC",{"$f":"Q5/(Q5+Q6)*Q7+Q6/(Q5+Q6)*Q8*(1-Q9)","v":{"$error":"#N/A"}},{"$f":"R5/(R5+R6)*R7+R6/(R5+R6)*R8*(1-Q9)","v":{"$error":"#DIV/0!"}},{"$f":"S5/(S5+S6)*S7+S6/(S5+S6)*S8*(1-Q9)","v":{"$error":"#DIV/0!"}}]
["Projekt:",{"$nulls":8},"Zellen enthalten integrierte Formeln, können aber geändert werden",{"$nulls":5},"Eigenkapital",{"$f":"'Tatsächliches Szenario'!B58","v":1000},{"$f":"'Kontrafaktisches Szenario'!B53","v":0},{"$f":"R5","v":0}]
["Datum: ",{"$nulls":8},"Zellen benötigen Eingabedaten",{"$nulls":5},"Fremdkapital",{"$f":"'Tatsächliches Szenario'!B55","v":0},{"$f":"'Kontrafaktisches Szenario'!B51","v":0},{"$f":"R6","v":0}]
["Kategorie (Nummer der Vorhabenskategorie siehe Tabelle rechts):",{"$nulls":14},"rEK",{"$f":"VLOOKUP(G7,P11:Q17,2,TRUE)","v":{"$error":"#N/A"}},{"$f":"VLOOKUP(G7,P11:R17,2,TRUE)","v":{"$error":"#N/A"}},{"$f":"VLOOKUP(G7,P11:R17,3,TRUE)","v":{"$error":"#N/A"}}]
["Höchstzulässiger Fördersatz laut Förderrichtlinie (in Prozent)",{"$nulls":14},"rFK",{"$f":"'Tatsächliches Szenario'!C57","v":0},{"$f":"'Kontrafaktisches Szenario'!C52","v":0},{"$f":"'Kontrafaktisches Szenario'!C52","v":0}]
[{"$nulls":15},"Steuersatz",{"$f":"'Tatsächliches Szenario'!B16","v":0}]
[{"$nulls":15},"Kategorie","Zinssatz rEK","rEK-Altanlagen","AfA ","AGVO-Art.","Fördersatz"]
{"$rows_left_out":18}
{"sheet":"Tatsächliches Szenario","index":15,"n_rows":63,"n_cols":51,"rows_kept":63,"cut":false,"hidden":true,"merged":[[2,4,2,9],[3,4,3,9],[4,4,4,9],[2,3,4,3]]}
["Berechnung der Finanzierungslücke - Tatsächliches Szenario"]
[]
[{"$f":"Deckblatt!B4","v":0},null,null,"LEGENDE","Zellen enthalten integrierte Formeln und Verknüpfungen - nicht ändern"]
[{"$f":"Deckblatt!B5","v":0},null,null,null,"Zellen enthalten integrierte Formeln, können aber geändert werden"]
[{"$f":"Deckblatt!B6","v":"00:00:00"},null,null,null,"Zellen benötigen Eingabedaten"]
[{"$f":"VLOOKUP(Deckblatt!G7,Deckblatt!J11:O17,2,TRUE)","v":{"$error":"#N/A"}}]
[]
["Allgemeine Angaben"]
[]
["Nummer der Vorhabenskategorie (aus \"Deckblatt\")",{"$f":"Deckblatt!G7","v":0}]
{"$rows_left_out":54}
{"sheet":"Kontrafaktisches Szenario","index":16,"n_rows":55,"n_cols":51,"rows_kept":55,"cut":false,"hidden":true,"merged":[[2,3,4,3],[2,4,2,9],[3,4,3,9],[4,4,4,9]]}
["Berechnung der Finanzierungslücke - Tatsächliches Szenario"]
[]
[{"$f":"Deckblatt!B4","v":0},null,null,"LEGENDE","Zellen enthalten integrierte Formeln und Verknüpfungen - nicht ändern"]
[{"$f":"Deckblatt!B5","v":0},null,null,null,"Zellen enthalten integrierte Formeln, können aber geändert werden"]
[{"$f":"Deckblatt!B6","v":"00:00:00"},null,null,null,"Zellen benötigen Eingabedaten"]
[{"$f":"VLOOKUP(Deckblatt!G7,Deckblatt!J11:O17,2,TRUE)","v":{"$error":"#N/A"}}]
[]
["Allgemeine Angaben"]
[]
["Nummer der Vorhabenskategorie (aus \"Deckblatt\")",{"$f":"Deckblatt!G7","v":0}]
{"$rows_left_out":46}
{"sheet":"Zusammenfassung","index":17,"n_rows":29,"n_cols":5,"rows_kept":29,"cut":false,"hidden":true,"merged":[[2,4,2,9],[3,4,3,9],[4,4,4,9],[2,3,4,3]]}
["Zusammenfassung Berechnung der Finanzierungslücke "]
[]
[{"$f":"Deckblatt!B4","v":0},null,null,"LEGENDE","Zellen enthalten integrierte Formeln und Verknüpfungen - nicht ändern"]
[{"$f":"Deckblatt!B5","v":0},null,null,null,"Zellen enthalten integrierte Formeln, können aber geändert werden"]
[{"$f":"Deckblatt!B6","v":"00:00:00"},null,null,null,"Zellen benötigen Eingabedaten"]
[{"$f":"VLOOKUP(Deckblatt!G7,Deckblatt!J11:O17,2,TRUE)","v":{"$error":"#N/A"}}]
[]
["Finanzierungslücke"]
[]
[null,"Betrag in EUR"]
{"$rows_left_out":20}
{"sheet":"Ablage","index":18,"n_rows":77,"n_cols":12,"rows_kept":77,"cut":false,"hidden":true,"merged":[]}
["ABLAGE",null,"Tabelle Ausblenden"]
["Dropdownfelder"]
[]
["Kopiervorlagen: Diese Daten müssen händisch in die jeweiligen Tabellen übertragen werden, wenn sie für Dropdown genutzt werden sollen. Excel erlaubt in früheren Versionen keinen Dropdowndaten über mehrere Tabellen hinweg."]
[]
[{"$nulls":9},"Instandhaltungskosten",null,"Betriebskosten"]
["Auswahl","zugeordneter Brennstoff","KWK-Schalter",{"$nulls":6},"% der Investition",null,"% der Erlöse"]
["KESSEL_Erdgas","Erdgas",{"$nulls":7},"Euro pauschal ",null,"Euro pauschal "]
["KESSEL_Biogas","Biogas"]
["KESSEL_Biomethan","Biomethan"]
{"$rows_left_out":67}